Jump to content

Kompilacja kernela błąd


ghost25
 Share

Recommended Posts

Próbuje sobie skompilować kernel według tego: http://en.miui.com/thread-293285-1-1.html I jest błąd, a nawet kilka:

[email protected]:~/kernel_workspace/MiCode$ make wt88509_64-per
f_defconfig
 HOSTCC  scripts/basic/fixdep
 HOSTCC  scripts/kconfig/conf.o
 SHIPPED scripts/kconfig/zconf.tab.c
 SHIPPED scripts/kconfig/zconf.lex.c
 SHIPPED scripts/kconfig/zconf.hash.c
 HOSTCC  scripts/kconfig/zconf.tab.o
In file included from scripts/kconfig/zconf.tab.c:2503:0: 
scripts/kconfig/menu.c: In function ‘get_symbol_str’: 
scripts/kconfig/menu.c:567:18: warning: ‘jump’ may be used uninitia
lized in this function [-Wmaybe-uninitialized] 
    jump->offset = r->len - 1; 
    ~~~~~~~~~~~~~^~~~~~~~~~~~ 
scripts/kconfig/menu.c:528:19: note: ‘jump’ was declared here 
 struct jump_key *jump; 
                  ^~~~ 
 HOSTLD  scripts/kconfig/conf
warning: (SND_SOC_QDSP6V2) selects SND_SOC_MSM_QDSP6V2_INTF which h
as unmet direct dependencies (SOUND && !M68K && !UML && SND && SND_
SOC && MSM_QDSP6_APRV2)
warning: (SND_SOC_APQ8084 && SND_SOC_MSM8X16 && SND_SOC_MSM8994) se
lects SND_SOC_CPE which has unmet direct dependencies (SOUND && !M6
8K && !UML && SND && SND_SOC && SND_SOC_WCD_CPE)
warning: (ARCH_MSM) selects DEVFREQ_GOV_MSM_BW_HWMON which has unme
t direct dependencies (PM_DEVFREQ && (ARCH_MSM_KRAIT || ARCH_MSM_BI
MC_BWMON))
warning: (SND_SOC_QDSP6V2) selects SND_SOC_MSM_QDSP6V2_INTF which h
as unmet direct dependencies (SOUND && !M68K && !UML && SND && SND_
SOC && MSM_QDSP6_APRV2)
warning: (SND_SOC_APQ8084 && SND_SOC_MSM8X16 && SND_SOC_MSM8994) se
lects SND_SOC_CPE which has unmet direct dependencies (SOUND && !M6
8K && !UML && SND && SND_SOC && SND_SOC_WCD_CPE)
warning: (ARCH_MSM) selects DEVFREQ_GOV_MSM_BW_HWMON which has unme
t direct dependencies (PM_DEVFREQ && (ARCH_MSM_KRAIT || ARCH_MSM_BI
MC_BWMON))
#
# configuration written to .config
#
[email protected]:~/kernel_workspace/MiCode$ make -j4 
scripts/kconfig/conf --silentoldconfig Kconfig
warning: (SND_SOC_QDSP6V2) selects SND_SOC_MSM_QDSP6V2_INTF which h
as unmet direct dependencies (SOUND && !M68K && !UML && SND && SND_
SOC && MSM_QDSP6_APRV2)
warning: (SND_SOC_APQ8084 && SND_SOC_MSM8X16 && SND_SOC_MSM8994) se
lects SND_SOC_CPE which has unmet direct dependencies (SOUND && !M6
8K && !UML && SND && SND_SOC && SND_SOC_WCD_CPE)
warning: (ARCH_MSM) selects DEVFREQ_GOV_MSM_BW_HWMON which has unme
t direct dependencies (PM_DEVFREQ && (ARCH_MSM_KRAIT || ARCH_MSM_BI
MC_BWMON))
warning: (SND_SOC_QDSP6V2) selects SND_SOC_MSM_QDSP6V2_INTF which h
as unmet direct dependencies (SOUND && !M68K && !UML && SND && SND_
SOC && MSM_QDSP6_APRV2)
warning: (SND_SOC_APQ8084 && SND_SOC_MSM8X16 && SND_SOC_MSM8994) se
lects SND_SOC_CPE which has unmet direct dependencies (SOUND && !M6
8K && !UML && SND && SND_SOC && SND_SOC_WCD_CPE)
warning: (ARCH_MSM) selects DEVFREQ_GOV_MSM_BW_HWMON which has unme
t direct dependencies (PM_DEVFREQ && (ARCH_MSM_KRAIT || ARCH_MSM_BI
MC_BWMON))
 WRAP    arch/arm64/include/generated/asm/bugs.h
 WRAP    arch/arm64/include/generated/asm/checksum.h
 WRAP    arch/arm64/include/generated/asm/clkdev.h
 WRAP    arch/arm64/include/generated/asm/cputime.h
 WRAP    arch/arm64/include/generated/asm/current.h
 WRAP    arch/arm64/include/generated/asm/delay.h
 WRAP    arch/arm64/include/generated/asm/div64.h
 WRAP    arch/arm64/include/generated/asm/dma.h
 WRAP    arch/arm64/include/generated/asm/emergency-restart.h
 WRAP    arch/arm64/include/generated/asm/early_ioremap.h
 WRAP    arch/arm64/include/generated/asm/errno.h
 WRAP    arch/arm64/include/generated/asm/ftrace.h
 WRAP    arch/arm64/include/generated/asm/hw_irq.h
 WRAP    arch/arm64/include/generated/asm/ioctl.h
 WRAP    arch/arm64/include/generated/asm/ioctls.h
 WRAP    arch/arm64/include/generated/asm/ipcbuf.h
 WRAP    arch/arm64/include/generated/asm/irq_regs.h
 WRAP    arch/arm64/include/generated/asm/kdebug.h
 WRAP    arch/arm64/include/generated/asm/kmap_types.h
 WRAP    arch/arm64/include/generated/asm/kvm_para.h
 WRAP    arch/arm64/include/generated/asm/local.h
 WRAP    arch/arm64/include/generated/asm/local64.h
 WRAP    arch/arm64/include/generated/asm/mcs_spinlock.h
 WRAP    arch/arm64/include/generated/asm/mman.h
 WRAP    arch/arm64/include/generated/asm/msgbuf.h
 WRAP    arch/arm64/include/generated/asm/mutex.h
 WRAP    arch/arm64/include/generated/asm/pci.h
 WRAP    arch/arm64/include/generated/asm/poll.h
 WRAP    arch/arm64/include/generated/asm/resource.h
 WRAP    arch/arm64/include/generated/asm/rwsem.h
 WRAP    arch/arm64/include/generated/asm/scatterlist.h
 WRAP    arch/arm64/include/generated/asm/sections.h
 WRAP    arch/arm64/include/generated/asm/segment.h
 WRAP    arch/arm64/include/generated/asm/sembuf.h
 WRAP    arch/arm64/include/generated/asm/serial.h
 WRAP    arch/arm64/include/generated/asm/shmbuf.h
 WRAP    arch/arm64/include/generated/asm/simd.h
 WRAP    arch/arm64/include/generated/asm/sizes.h
 WRAP    arch/arm64/include/generated/asm/socket.h
 WRAP    arch/arm64/include/generated/asm/sockios.h
 WRAP    arch/arm64/include/generated/asm/swab.h
 WRAP    arch/arm64/include/generated/asm/switch_to.h
 WRAP    arch/arm64/include/generated/asm/termbits.h
 WRAP    arch/arm64/include/generated/asm/termios.h
 WRAP    arch/arm64/include/generated/asm/topology.h
 WRAP    arch/arm64/include/generated/asm/trace_clock.h
 WRAP    arch/arm64/include/generated/asm/types.h
 WRAP    arch/arm64/include/generated/asm/unaligned.h
 WRAP    arch/arm64/include/generated/asm/user.h
 WRAP    arch/arm64/include/generated/asm/vga.h
 WRAP    arch/arm64/include/generated/asm/xor.h
 CHK     include/generated/uapi/linux/version.h
 UPD     include/generated/uapi/linux/version.h
 WRAP    arch/arm64/include/generated/uapi/asm/kvm_para.h
 CHK     include/generated/utsrelease.h
 UPD     include/generated/utsrelease.h
 HOSTCC  scripts/dtc/checks.o
 HOSTCC  scripts/genksyms/genksyms.o
 CC      scripts/mod/empty.o
as: nieznana opcja '-EL'
scripts/Makefile.build:308: polecenia dla obiektu 'scripts/mod/empt
y.o' nie powiodły się
make[2]: *** [scripts/mod/empty.o] Błąd 1
scripts/Makefile.build:455: polecenia dla obiektu 'scripts/mod' nie
powiodły się
make[1]: *** [scripts/mod] Błąd 2
make[1]: *** Oczekiwanie na niezakończone zadania....
 HOSTCC  scripts/dtc/data.o
 SHIPPED scripts/dtc/dtc-lexer.lex.c
 SHIPPED scripts/genksyms/lex.lex.c
 SHIPPED scripts/genksyms/keywords.hash.c
 SHIPPED scripts/genksyms/parse.tab.h
 SHIPPED scripts/genksyms/parse.tab.c
 SHIPPED scripts/dtc/dtc-parser.tab.h
 HOSTCC  scripts/genksyms/lex.lex.o
 SHIPPED scripts/dtc/dtc-parser.tab.c
 HOSTCC  scripts/dtc/dtc.o
 HOSTCC  scripts/dtc/flattree.o
 HOSTCC  scripts/dtc/fstree.o
 HOSTCC  scripts/genksyms/parse.tab.o
 HOSTCC  scripts/dtc/livetree.o
 HOSTLD  scripts/genksyms/genksyms
 HOSTCC  scripts/dtc/srcpos.o
 HOSTCC  scripts/dtc/treesource.o
 HOSTCC  scripts/dtc/util.o
 HOSTCC  scripts/dtc/dtc-lexer.lex.o
 HOSTCC  scripts/dtc/dtc-parser.tab.o
 CC      kernel/bounds.s
 HOSTLD  scripts/dtc/dtc
 GEN     include/generated/bounds.h
 CC      arch/arm64/kernel/asm-offsets.s
Makefile:517: polecenia dla obiektu 'scripts' nie powiodły się
make: *** [scripts] Błąd 2
make: *** Oczekiwanie na niezakończone zadania....
 GEN     include/generated/asm-offsets.h
 CALL    scripts/checksyscalls.sh

System to Kali Linux (bazujący na Debianie). Co zrobić żeby zadziałało?

Edited by ghost25
Link to comment
Share on other sites

  • mrosi locked this topic
Guest
This topic is now closed to further replies.
 Share

×
×
  • Create New...